Home>
D:\My work\All templates\html>npm i
npm WARN deprecated [email protected]: See https://github.com/lydell/source-map-url#deprecated
npm WARN deprecated [email protected]: this library is no longer supported
npm WARN deprecated [email protected]: Please see https://github.com/lydell/urix#deprecated
npm WARN deprecated [email protected]: See https://github.com/lydell/source-map-resolve#deprecated
npm WARN deprecated [email protected]: Chokidar 2 will break on node v14+. Upgrade to chokidar 3 with 15x less dependencies.
npm WARN deprecated [email protected]: https://github.com/lydell/resolve-url#deprecated
npm WARN deprecated [email protected]: Debug versions >=3.2.0<3.2.7 || >=4<4.3.1 have a low-severity ReDos regression when used in a Node.js environment. It is recommended you upgrade to 3.2.7 or 4.3.1. (https://github.com/visionmedia/debug/issues/797)
npm WARN deprecated [email protected]: Debug versions >=3.2.0<3.2.7 || >=4<4.3.1 have a low-severity ReDos regression when used in a Node.js environment. It is recommended you upgrade to 3.2.7 or 4.3.1. (https://github.com/visionmedia/debug/issues/797)
npm WARN deprecated [email protected]: Debug versions >=3.2.0<3.2.7 || >=4<4.3.1 have a low-severity ReDos regression when used in a Node.js environment. It is recommended you upgrade to 3.2.7 or 4.3.1. (https://github.com/visionmedia/debug/issues/797)
npm WARN deprecated [email protected]: Deprecated due to CVE-2021-21366 resolved in 0.5.0
npm WARN deprecated [email protected]: gulp-util is deprecated -replace it, following the guidelines at https://medium.com/gulpjs/gulp-util-ca3b1f9f9ac5
npm WARN deprecated [email protected]: this package is now deprecated
npm WARN deprecated [email protected]: Please upgrade to version 7 or higher. Older versions may use Math.random() in certain circumstances, which is known to be problematic. See https://v8.dev/blog/math-random for details.
npm WARN deprecated [email protected]: request has been deprecated, see https://github.com/request/request/issues/3142
npm WARN deprecated [email protected]: This SVGO version is no longer supported. Upgrade to v2.x.x.
npm WARN deprecated [email protected]: This version of tar is no longer supported, and will not receive security updates. Please upgrade asap.
npm ERR! code 1
npm ERR! path D:\My Works\All Templates\html\node_modules\node-sass
npm ERR! command failed
npm ERR! command C:\Windows\system32\cmd.exe /d /s /c node scripts/build.js
npm ERR! Building: C:\Program Files\nodejs\node.exe D:\My Works\All Templates\html\node_modules\node-gyp\bin\node-gyp.js rebuild --verbose --libsass_ext= --libsass_cflags= --libsass_ldflags= --libsass_library=
npm ERR! gyp info it worked if it ends with ok
npm ERR! gyp verb cli [
npm ERR! gyp verb cli 'C:\\Program Files\\nodejs\\node.exe',
npm ERR! gyp verb cli 'D:\\My work\\All templates\\html\\node_modules\\node-gyp\\bin\\node-gyp.js',
npm ERR! gyp verb cli 'rebuild',
npm ERR! gyp verb cli '--verbose',
npm ERR! gyp verb cli '--libsass_ext=',
npm ERR! gyp verb cli '--libsass_cflags=',
npm ERR! gyp verb cli '--libsass_ldflags=',
npm ERR! gyp verb cli '--libsass_library='
npm ERR! hyp verb cli]
npm ERR! gypinfo using [email protected]
npm ERR! gypinfo using [email protected] | win32 | x64
npm ERR! gypverb command rebuild []
npm ERR! gypverb command clean []
npm ERR! gyp verb clean removing "build" directory
npm ERR! gyp verb command configure []
npm ERR! gyp verb check python checking for Python executable "C:\Python27\python.exe" in the PATH
npm ERR! gyp verb `which` failed Error: not found: C:\Python27\python.exe
npm ERR! gyp verb `which` failed at getNotFoundError (D:\My Works\All Templates\html\node_modules\which\which.js:13:12)
npm ERR! gyp verb `which` failed at F (D:\My Works\All Templates\html\node_modules\which\which.js:68:19)
npm ERR! gyp verb `which` failed at E (D:\My Works\All Templates\html\node_modules\which\which.js:80:29)npm ERR! gyp verb `which` failed at D:\My Works\All Templates\html\node_modules\which\which.js:89:16npm ERR! gyp verb `which` failed at D:\My Works\All Templates\html\node_modules\isexe\index.js:42:5
npm ERR! gyp verb `which` failed at D:\My Works\All Templates\html\node_modules\isexe\windows.js:36:5
npm ERR! gyp verb `which` failed at FSReqCallback.oncomplete (node:fs:198:21)
npm ERR! gyp verb `which` failed C:\Python27\python.exe Error: not found: C:\Python27\python.exe
npm ERR! gyp verb `which` failed at getNotFoundError (D:\My Works\All Templates\html\node_modules\which\which.js:13:12)
npm ERR! gyp verb `which` failed at F (D:\My Works\All Templates\html\node_modules\which\which.js:68:19)
npm ERR! gyp verb `which` failed at E (D:\My Works\All Templates\html\node_modules\which\which.js:80:29)
npm ERR! gyp verb `which` failed at D:\My Works\All Templates\html\node_modules\which\which.js:89:16
npm ERR! gyp verb `which` failed at D:\My Works\All Templates\html\node_modules\isexe\index.js:42:5
npm ERR! gyp verb `which` failed at D:\My Works\All Templates\html\node_modules\isexe\windows.js:36:5
npm ERR! gyp verb `which` failed at FSReqCallback.oncomplete (node:fs:198:21) {
npm ERR! gyp verb `which` failed code: 'ENOENT'
npm ERR! gyp verb `which` failed }
npm ERR! gyp verb could not find "C:\Python27\python.exe". checking python launcher
npm ERR! gyp verb check python launcher python executable found: "C:\\Users\\Yaroslav-PC\\.windows-build-tools\\python27\\python.exe"
npm ERR! gyp verb check python version `C:\Users\Yaroslav-PC\.windows-build-tools\python27\python.exe -c "import sys; print "2.7.18
npm ERR! gyp verb check python version .%s.%s" % sys.version_info[:3];"` returned: %j
npm ERR! gyp verb get node dir no --target version specified, falling back to host node version: 16.13.2
npm ERR! gyp verb command install [ '16.13.2' ]
npm ERR! gyp verb install input version string "16.13.2"
npm ERR! gyp verb install install version: 16.13.2
npm ERR! gyp verb install --ensure was passed, so won't reinstall if already installed
npm ERR! gyp verb install version is already installed, need to check "installVersion"
npm ERR! gypverb got "installVersion" 9
npm ERR! gypverb needs "installVersion" 9
npm ERR! gyp verb install version is good
npm ERR! gyp verb get node dir target node version installed: 16.13.2
npm ERR! gyp verb build dir attempting to create "build" dir: D:\My Works\All Templates\html\node_modules\node-sass\build
npm ERR! gyp verb build dir "build" dir needed to be created? D:\My Works\All Templates\html\node_modules\node-sass\build
npm ERR! gyp verb build/config.gypi creating config file
npm ERR! gyp verb build/config.gypi writing out config file: D:\My Works\All Templates\html\node_modules\node-sass\build\config.gypi
npm ERR! (node:5868) [DEP0150] DeprecationWarning: Setting process.config is deprecated. In the future the property will be read-only.
npm ERR! (Use `node --trace-deprecation ...` to show where the warning was created)
npm ERR! gyp verb config.gypi checking for gypi file: D:\My Works\All Templates\html\node_modules\node-sass\config.gypi
npm ERR! gyp verb common.gypi checking for gypi file: D:\My Works\All Templates\html\node_modules\node-sass\common.gypi
npm ERR! gyp verb gyp gyp format was not specified; forcing "msvs"
npm ERR! gyp info spawn C:\Users\Yaroslav-PC\.windows-build-tools\python27\python.exe
npm ERR! gyp info spawn args [
npm ERR! gyp info spawn args 'D:\\My Works\\All Templates\\html\\node_modules\\node-gyp\\gyp\\gyp_main.py',
npm ERR! gyp info spawn args 'binding.gyp',
npm ERR! gyp info spawn args '-f',
npm ERR! gyp info spawn args 'msvs',
npm ERR! gyp info spawn args '-G',
npm ERR! gyp info spawn args 'msvs_version=2019',
npm ERR! gyp info spawn args '-I',npm ERR! gyp info spawn args 'D:\\My Works\\All Templates\\html\\node_modules\\node-sass\\build\\config.gypi',npm ERR! gyp info spawn args '-I',
npm ERR! gyp info spawn args 'D:\\My Works\\All Templates\\html\\node_modules\\node-gyp\\addon.gypi',
npm ERR! gyp info spawn args '-I',
npm ERR! gyp info spawn args 'C:\\Users\\Yaroslav-PC\\.node-gyp\\16.13.2\\include\\node\\common.gypi',
npm ERR! gyp info spawn args '-Dlibrary=shared_library',
npm ERR! gyp info spawn args '-Dvisibility=default',
npm ERR! gyp info spawn args '-Dnode_root_dir=C:\\Users\\Yaroslav-PC\\.node-gyp\\16.13.2',
npm ERR! gyp info spawn args '-Dnode_gyp_dir=D:\\My Works\\All Templates\\html\\node_modules\\node-gyp',
npm ERR! gyp info spawn args '-Dnode_lib_file=C:\\Users\\Yaroslav-PC\\.node-gyp\\16.13.2\\<(target_arch)\\node.lib',
npm ERR! gyp info spawn args '-Dmodule_root_dir=D:\\My Works\\All Templates\\html\\node_modules\\node-sass',
npm ERR! gyp info spawn args '-Dnode_engine=v8',
npm ERR! gyp info spawn args '--depth=.',
npm ERR! gyp info spawn args '--no-parallel',
npm ERR! gyp info spawn args '--generator-output',
npm ERR! gyp info spawn args 'D:\\My Works\\All Templates\\html\\node_modules\\node-sass\\build',
npm ERR! gyp info spawn args '-Goutput_dir=.'
npm ERR! gyp info spawn args ]
npm ERR! Traceback (most recent call last):
npm ERR! File "D:\���� ������\��� ������\html\node_modules\node-gyp\gyp\gyp_main.py", line 16, in <module>npm ERR! sys.exit(gyp.script_main())
npm ERR! File "D:\���� ������\��� ������\html\node_modules\node-gyp\gyp\pylib\gyp\__init__.py", line 545, in script_main
npm ERR! return main(sys.argv[1:])
npm ERR! File "D:\���� ������\��� ������\html\node_modules\node-gyp\gyp\pylib\gyp\__init__.py", line 538, in main
npm ERR! return gyp_main(args)
npm ERR! File "D:\���� ������\��� ������\html\node_modules\node-gyp\gyp\pylib\gyp\__init__.py", line 514, in gyp_main
npm ERR! options.duplicate_basename_check)
npm ERR! File "D:\���� ������\��� ������\html\node_modules\node-gyp\gyp\pylib\gyp\__init__.py", line 98, in load
npm ERR! generator.CalculateVariables(default_variables, params)
npm ERR! File "D:\���� ������\��� ������\html\node_modules\node-gyp\gyp\pylib\gyp\generator\msvs.py", line 1916 , in CalculateVariables
npm ERR! generator_flags.get('msvs_version', 'auto'))
npm ERR! File "D:\���� ������\��� ������\html\node_modules\node-gyp\gyp\pylib\gyp\MSVSVersion.py", line 434, in SelectVisualStudioVersion
npm ERR! versions= _DetectVisualStudioVersions(version_map[version],
 'e' in version)
npm ERR! KeyError: '2019'
npm ERR! gyp ERR! configure error
npm ERR! gyp ERR! stack Error: `gyp` failed with exit code: 1
npm ERR! gyp ERR! stack at ChildProcess.onCpExit (D:\My Works\All Templates\html\node_modules\node-gyp\lib\configure.js:345:16)
npm ERR! gyp ERR! stack at ChildProcess.emit(node:events:390:28)
npm ERR! gyp ERR! stack at Process.ChildProcess._handle.onexit (node:internal/child_process:290:12)
npm ERR! gyp ERR! System Windows_NT 10.0.19044
npm ERR! gyp ERR! command "C:\\Program Files\\nodejs\\node.exe" "D:\\My Works\\All Templates\\html\\node_modules\\node-gyp\\bin\\node-gyp.js" "rebuild" "--verbose" "--libsass_ext=""--libsass_cflags=""--libsass_ldflags=""--libsass_library="
npm ERR! gyp ERR! cwd D:\My Works\All Templates\html\node_modules\node-sass
npm ERR! gyp ERR! node -v v16.13.2
npm ERR! gyp ERR! node-gyp -v v3.8.0
npm ERR! gyp ERR! not ok
npm ERR! Build failed with error code: 1
npm ERR! A complete log of this run can be found in:
npm ERR! C:\Users\Yaroslav-PC\AppData\Local\npm-cache\_logs\2022-01-15T18_45_05_755Z-debug-0.log

Please elaborate on your specific problem or provide more details on what exactly you need. In its current form, it's hard to understand exactly what you're asking.

Дух сообщества2022-01-18 01:09:13
  • Answer # 1

    Your dependencies are tied to node-gyp. Try to install it globally following the instructions https://github.com/nodejs/node-gyp#installation. You will need to install Python and Visual C++ Build Environment

  • Answer # 2

    Your dependencies are tied to node-gyp. Try to install it globally following the instructions https://github.com/nodejs/node-gyp#installation. You will need to install Python and Visual C++ Build Environment